| 网站首页 | 业界新闻 | 小组 | 威客 | 人才 | 下载频道 | 博客 | 代码贴 | 在线编程 | 编程论坛
欢迎加入我们,一同切磋技术
用户名:   
 
密 码:  
共有 2797 人关注过本帖
标题:一个小小小练习 不知为何报错。。
取消只看楼主 加入收藏
哒哒哒啦啦啦
Rank: 1
等 级:新手上路
帖 子:75
专家分:4
注 册:2016-2-26
结帖率:76.92%
收藏
已结贴  问题点数:10 回复次数:5 
一个小小小练习 不知为何报错。。
感觉没错呀。。萌萌哒。。
#include<iostream>
#include<vector>
using namespace std;
using std::vector;
void main()
{
    vector<int> v1{10};
cout<<v1[0];

}
*********************************************************************************
1>------ Build started: Project: 11, Configuration: Debug Win32 ------
1>  22.cpp
1>c:\users\jin\documents\visual studio 2010\projects\11\11\22.cpp(7): error C2601: 'v1' : local function definitions are illegal
1>          c:\users\jin\documents\visual studio 2010\projects\11\11\22.cpp(6): this line contains a '{' which has not yet been matched
1>c:\users\jin\documents\visual studio 2010\projects\11\11\22.cpp(7): error C2143: syntax error : missing ';' before '}'
1>c:\users\jin\documents\visual studio 2010\projects\11\11\22.cpp(8): error C2065: 'v1' : undeclared identifier
========== Build: 0 succeeded, 1 failed, 0 up-to-date, 0 skipped ==========
搜索更多相关主题的帖子: documents function include started visual 
2016-03-15 20:30
哒哒哒啦啦啦
Rank: 1
等 级:新手上路
帖 子:75
专家分:4
注 册:2016-2-26
收藏
得分:0 
在线等。。
2016-03-15 20:35
哒哒哒啦啦啦
Rank: 1
等 级:新手上路
帖 子:75
专家分:4
注 册:2016-2-26
收藏
得分:0 
2016-03-15 20:39
哒哒哒啦啦啦
Rank: 1
等 级:新手上路
帖 子:75
专家分:4
注 册:2016-2-26
收藏
得分:0 
回复 5楼 无冥拉丁
这是一个课后验证练习,这样子写应该也是没错的。。可就是有问题啊啊啊
2016-03-15 21:32
哒哒哒啦啦啦
Rank: 1
等 级:新手上路
帖 子:75
专家分:4
注 册:2016-2-26
收藏
得分:0 
回复 7楼 无冥拉丁
2010。。。。2015可以了
2016-03-15 21:51
哒哒哒啦啦啦
Rank: 1
等 级:新手上路
帖 子:75
专家分:4
注 册:2016-2-26
收藏
得分:0 
回复 8楼 hjx1120
好了。。
2016-03-15 21:51
快速回复:一个小小小练习 不知为何报错。。
数据加载中...
 
   



关于我们 | 广告合作 | 编程中国 | 清除Cookies | TOP | 手机版

编程中国 版权所有,并保留所有权利。
Powered by Discuz, Processed in 0.021003 second(s), 9 queries.
Copyright©2004-2024, BCCN.NET, All Rights Reserved