| 网站首页 | 业界新闻 | 群组 | 人才 | 下载频道 | 博客 | 代码贴 | 编程论坛
共有 5370 人关注过本帖
标题:利用 vs2008 设计一个 helloworld 对话框,基于 M3350_SDK(ARM4I),编译出现 ...
只看楼主 收藏
lixinming913
Rank: 1
等 级:新手上路
帖 子:5
专家分:0
注 册:2014-4-25
结帖率:33.33%
  已结贴   问题点数:18  回复次数:2   
利用 vs2008 设计一个 helloworld 对话框,基于 M3350_SDK(ARM4I),编译出现问题
点击按钮弹出字符,都按照流程走的,但是编译时出现100多个错误,求解决方案

1>------ Build started: Project: Hello World, Configuration: Debug M3350_SDK (ARMv4I) ------
1>Compiling...
1>stdafx.cpp
1>d:\program files\windows ce tools\sdks\m3350_sdk\include\armv4i\stdlib.h(179) : error C2146: 语法错误 : 缺少“;”(在标识符“errno_t”的前面)
1>d:\program files\windows ce tools\sdks\m3350_sdk\include\armv4i\stdlib.h(179) : error C4430: 缺少类型说明符 - 假定为 int。注意: C++ 不支持默认 int
1>d:\program files\windows ce tools\sdks\m3350_sdk\include\armv4i\stdlib.h(184) : error C2146: 语法错误 : 缺少“;”(在标识符“errno_t”的前面)
1>d:\program files\windows ce tools\sdks\m3350_sdk\include\armv4i\stdlib.h(184) : error C4430: 缺少类型说明符 - 假定为 int。注意: C++ 不支持默认 int
1>d:\program files\windows ce tools\sdks\m3350_sdk\include\armv4i\stdlib.h(184) : error C2086: “int __checkReturn_wat”: 重定义
1>        d:\program files\windows ce tools\sdks\m3350_sdk\include\armv4i\stdlib.h(179) : 参见“__checkReturn_wat”的声明
1>d:\program files\windows ce tools\sdks\m3350_sdk\include\armv4i\stdlib.h(196) : error C2146: 语法错误 : 缺少“;”(在标识符“errno_t”的前面)
1>d:\program files\windows ce tools\sdks\m3350_sdk\include\armv4i\stdlib.h(196) : error C4430: 缺少类型说明符 - 假定为 int。注意: C++ 不支持默认 int
1>d:\program files\windows ce tools\sdks\m3350_sdk\include\armv4i\stdlib.h(196) : error C2086: “int __checkReturn_wat”: 重定义
1>        d:\program files\windows ce tools\sdks\m3350_sdk\include\armv4i\stdlib.h(179) : 参见“__checkReturn_wat”的声明
1>d:\program files\windows ce tools\sdks\m3350_sdk\include\armv4i\stdlib.h(202) : error C2146: 语法错误 : 缺少“;”(在标识符“errno_t”的前面)
1>d:\program files\windows ce tools\sdks\m3350_sdk\include\armv4i\stdlib.h(202) : error C4430: 缺少类型说明符 - 假定为 int。注意: C++ 不支持默认 int
1>d:\program files\windows ce tools\sdks\m3350_sdk\include\armv4i\stdlib.h(202) : error C2086: “int __checkReturn_wat”: 重定义
1>        d:\program files\windows ce tools\sdks\m3350_sdk\include\armv4i\stdlib.h(179) : 参见“__checkReturn_wat”的声明
1>d:\program files\windows ce tools\sdks\m3350_sdk\include\armv4i\stdlib.h(217) : error C2146: 语法错误 : 缺少“;”(在标识符“errno_t”的前面)
1>d:\program files\windows ce tools\sdks\m3350_sdk\include\armv4i\stdlib.h(217) : error C4430: 缺少类型说明符 - 假定为 int。注意: C++ 不支持默认 int
1>d:\program files\windows ce tools\sdks\m3350_sdk\include\armv4i\stdlib.h(217) : error C2086: “int __checkReturn_wat”: 重定义
1>        d:\program files\windows ce tools\sdks\m3350_sdk\include\armv4i\stdlib.h(179) : 参见“__checkReturn_wat”的声明
1>d:\program files\windows ce tools\sdks\m3350_sdk\include\armv4i\stdlib.h(220) : error C2146: 语法错误 : 缺少“;”(在标识符“errno_t”的前面)
1>d:\program files\windows ce tools\sdks\m3350_sdk\include\armv4i\stdlib.h(220) : error C4430: 缺少类型说明符 - 假定为 int。注意: C++ 不支持默认 int
1>d:\program files\windows ce tools\sdks\m3350_sdk\include\armv4i\stdlib.h(220) : error C2086: “int __checkReturn_wat”: 重定义
1>        d:\program files\windows ce tools\sdks\m3350_sdk\include\armv4i\stdlib.h(179) : 参见“__checkReturn_wat”的声明
1>d:\program files\windows ce tools\sdks\m3350_sdk\include\armv4i\stdlib.h(252) : error C2146: 语法错误 : 缺少“;”(在标识符“errno_t”的前面)
1>d:\program files\windows ce tools\sdks\m3350_sdk\include\armv4i\stdlib.h(252) : error C4430: 缺少类型说明符 - 假定为 int。注意: C++ 不支持默认 int
1>d:\program files\windows ce tools\sdks\m3350_sdk\include\armv4i\stdlib.h(252) : error C2086: “int __checkReturn_wat”: 重定义
1>        d:\program files\windows ce tools\sdks\m3350_sdk\include\armv4i\stdlib.h(179) : 参见“__checkReturn_wat”的声明
1>d:\program files\windows ce tools\sdks\m3350_sdk\include\armv4i\stdlib.h(257) : error C2146: 语法错误 : 缺少“;”(在标识符“errno_t”的前面)
1>d:\program files\windows ce tools\sdks\m3350_sdk\include\armv4i\stdlib.h(257) : error C4430: 缺少类型说明符 - 假定为 int。注意: C++ 不支持默认 int
1>d:\program files\windows ce tools\sdks\m3350_sdk\include\armv4i\stdlib.h(257) : error C2086: “int __checkReturn_wat”: 重定义
1>        d:\program files\windows ce tools\sdks\m3350_sdk\include\armv4i\stdlib.h(179) : 参见“__checkReturn_wat”的声明
1>d:\program files\windows ce tools\sdks\m3350_sdk\include\armv4i\stdlib.h(271) : error C2146: 语法错误 : 缺少“;”(在标识符“errno_t”的前面)
1>d:\program files\windows ce tools\sdks\m3350_sdk\include\armv4i\stdlib.h(271) : error C4430: 缺少类型说明符 - 假定为 int。注意: C++ 不支持默认 int
1>d:\program files\windows ce tools\sdks\m3350_sdk\include\armv4i\stdlib.h(271) : error C2086: “int __checkReturn_wat”: 重定义
1>        d:\program files\windows ce tools\sdks\m3350_sdk\include\armv4i\stdlib.h(179) : 参见“__checkReturn_wat”的声明
1>d:\program files\windows ce tools\sdks\m3350_sdk\include\armv4i\stdlib.h(277) : error C2146: 语法错误 : 缺少“;”(在标识符“errno_t”的前面)
1>d:\program files\windows ce tools\sdks\m3350_sdk\include\armv4i\stdlib.h(277) : error C4430: 缺少类型说明符 - 假定为 int。注意: C++ 不支持默认 int
1>d:\program files\windows ce tools\sdks\m3350_sdk\include\armv4i\stdlib.h(277) : error C2086: “int __checkReturn_wat”: 重定义
1>        d:\program files\windows ce tools\sdks\m3350_sdk\include\armv4i\stdlib.h(179) : 参见“__checkReturn_wat”的声明
1>d:\program files\windows ce tools\sdks\m3350_sdk\include\armv4i\stdlib.h(293) : error C2146: 语法错误 : 缺少“;”(在标识符“errno_t”的前面)
1>d:\program files\windows ce tools\sdks\m3350_sdk\include\armv4i\stdlib.h(293) : error C4430: 缺少类型说明符 - 假定为 int。注意: C++ 不支持默认 int
1>d:\program files\windows ce tools\sdks\m3350_sdk\include\armv4i\stdlib.h(293) : error C2086: “int __checkReturn_wat”: 重定义
1>        d:\program files\windows ce tools\sdks\m3350_sdk\include\armv4i\stdlib.h(179) : 参见“__checkReturn_wat”的声明
1>d:\program files\windows ce tools\sdks\m3350_sdk\include\armv4i\stdlib.h(296) : error C2146: 语法错误 : 缺少“;”(在标识符“errno_t”的前面)
1>d:\program files\windows ce tools\sdks\m3350_sdk\include\armv4i\stdlib.h(296) : error C4430: 缺少类型说明符 - 假定为 int。注意: C++ 不支持默认 int
1>d:\program files\windows ce tools\sdks\m3350_sdk\include\armv4i\stdlib.h(296) : error C2086: “int __checkReturn_wat”: 重定义
1>        d:\program files\windows ce tools\sdks\m3350_sdk\include\armv4i\stdlib.h(179) : 参见“__checkReturn_wat”的声明
1>d:\program files\windows ce tools\sdks\m3350_sdk\include\armv4i\stdlib.h(503) : error C2144: 语法错误 : “int”的前面应有“;”
1>d:\program files\windows ce tools\sdks\m3350_sdk\include\armv4i\stdlib.h(503) : error C4430: 缺少类型说明符 - 假定为 int。注意: C++ 不支持默认 int
1>d:\program files\windows ce tools\sdks\m3350_sdk\include\armv4i\stdlib.h(504) : error C2144: 语法错误 : “int”的前面应有“;”
1>d:\program files\windows ce tools\sdks\m3350_sdk\include\armv4i\stdlib.h(504) : error C4430: 缺少类型说明符 - 假定为 int。注意: C++ 不支持默认 int
1>d:\program files\windows ce tools\sdks\m3350_sdk\include\armv4i\stdlib.h(504) : error C2086: “int __checkReturn_opt”: 重定义
1>        d:\program files\windows ce tools\sdks\m3350_sdk\include\armv4i\stdlib.h(503) : 参见“__checkReturn_opt”的声明
1>d:\program files\windows ce tools\sdks\m3350_sdk\include\armv4i\stdlib.h(505) : error C2144: 语法错误 : “int”的前面应有“;”
1>d:\program files\windows ce tools\sdks\m3350_sdk\include\armv4i\stdlib.h(505) : error C4430: 缺少类型说明符 - 假定为 int。注意: C++ 不支持默认 int
1>d:\program files\windows ce tools\sdks\m3350_sdk\include\armv4i\stdlib.h(505) : error C2086: “int __checkReturn_opt”: 重定义
1>        d:\program files\windows ce tools\sdks\m3350_sdk\include\armv4i\stdlib.h(503) : 参见“__checkReturn_opt”的声明
1>d:\program files\windows ce tools\sdks\m3350_sdk\include\armv4i\stdlib.h(510) : error C2144: 语法错误 : “int”的前面应有“;”
1>d:\program files\windows ce tools\sdks\m3350_sdk\include\armv4i\stdlib.h(510) : error C4430: 缺少类型说明符 - 假定为 int。注意: C++ 不支持默认 int
1>d:\program files\windows ce tools\sdks\m3350_sdk\include\armv4i\stdlib.h(510) : error C2086: “int __checkReturn_opt”: 重定义
1>        d:\program files\windows ce tools\sdks\m3350_sdk\include\armv4i\stdlib.h(503) : 参见“__checkReturn_opt”的声明
1>d:\program files\windows ce tools\sdks\m3350_sdk\include\armv4i\stdlib.h(512) : error C2144: 语法错误 : “int”的前面应有“;”
1>d:\program files\windows ce tools\sdks\m3350_sdk\include\armv4i\stdlib.h(512) : error C4430: 缺少类型说明符 - 假定为 int。注意: C++ 不支持默认 int
1>d:\program files\windows ce tools\sdks\m3350_sdk\include\armv4i\stdlib.h(512) : error C2086: “int __checkReturn_opt”: 重定义
1>        d:\program files\windows ce tools\sdks\m3350_sdk\include\armv4i\stdlib.h(503) : 参见“__checkReturn_opt”的声明
1>d:\program files\windows ce tools\sdks\m3350_sdk\include\armv4i\stdlib.h(523) : error C2144: 语法错误 : “int”的前面应有“;”
1>d:\program files\windows ce tools\sdks\m3350_sdk\include\armv4i\stdlib.h(523) : error C4430: 缺少类型说明符 - 假定为 int。注意: C++ 不支持默认 int
1>d:\program files\windows ce tools\sdks\m3350_sdk\include\armv4i\stdlib.h(523) : error C2086: “int __checkReturn_opt”: 重定义
1>        d:\program files\windows ce tools\sdks\m3350_sdk\include\armv4i\stdlib.h(503) : 参见“__checkReturn_opt”的声明
1>d:\program files\windows ce tools\sdks\m3350_sdk\include\armv4i\stdlib.h(525) : error C2144: 语法错误 : “int”的前面应有“;”
1>d:\program files\windows ce tools\sdks\m3350_sdk\include\armv4i\stdlib.h(525) : error C4430: 缺少类型说明符 - 假定为 int。注意: C++ 不支持默认 int
1>d:\program files\windows ce tools\sdks\m3350_sdk\include\armv4i\stdlib.h(525) : error C2086: “int __checkReturn_opt”: 重定义
1>        d:\program files\windows ce tools\sdks\m3350_sdk\include\armv4i\stdlib.h(503) : 参见“__checkReturn_opt”的声明
1>d:\program files\windows ce tools\sdks\m3350_sdk\include\armv4i\stdlib.h(531) : error C2144: 语法错误 : “int”的前面应有“;”
1>d:\program files\windows ce tools\sdks\m3350_sdk\include\armv4i\stdlib.h(531) : error C4430: 缺少类型说明符 - 假定为 int。注意: C++ 不支持默认 int
1>d:\program files\windows ce tools\sdks\m3350_sdk\include\armv4i\stdlib.h(531) : error C2086: “int __checkReturn_opt”: 重定义
1>        d:\program files\windows ce tools\sdks\m3350_sdk\include\armv4i\stdlib.h(503) : 参见“__checkReturn_opt”的声明
1>d:\program files\windows ce tools\sdks\m3350_sdk\include\armv4i\stdlib.h(537) : error C2144: 语法错误 : “int”的前面应有“;”
1>d:\program files\windows ce tools\sdks\m3350_sdk\include\armv4i\stdlib.h(537) : error C4430: 缺少类型说明符 - 假定为 int。注意: C++ 不支持默认 int
1>d:\program files\windows ce tools\sdks\m3350_sdk\include\armv4i\stdlib.h(537) : error C2086: “int __checkReturn_opt”: 重定义
1>        d:\program files\windows ce tools\sdks\m3350_sdk\include\armv4i\stdlib.h(503) : 参见“__checkReturn_opt”的声明
1>d:\program files\windows ce tools\sdks\m3350_sdk\include\armv4i\stdlib.h(538) : error C2144: 语法错误 : “int”的前面应有“;”
1>d:\program files\windows ce tools\sdks\m3350_sdk\include\armv4i\stdlib.h(538) : error C4430: 缺少类型说明符 - 假定为 int。注意: C++ 不支持默认 int
1>d:\program files\windows ce tools\sdks\m3350_sdk\include\armv4i\stdlib.h(538) : error C2086: “int __checkReturn_opt”: 重定义
1>        d:\program files\windows ce tools\sdks\m3350_sdk\include\armv4i\stdlib.h(503) : 参见“__checkReturn_opt”的声明
1>d:\program files\windows ce tools\sdks\m3350_sdk\include\armv4i\stdlib.h(539) : error C2144: 语法错误 : “int”的前面应有“;”
1>d:\program files\windows ce tools\sdks\m3350_sdk\include\armv4i\stdlib.h(539) : error C4430: 缺少类型说明符 - 假定为 int。注意: C++ 不支持默认 int
1>d:\program files\windows ce tools\sdks\m3350_sdk\include\armv4i\stdlib.h(539) : error C2086: “int __checkReturn_opt”: 重定义
1>        d:\program files\windows ce tools\sdks\m3350_sdk\include\armv4i\stdlib.h(503) : 参见“__checkReturn_opt”的声明
1>d:\program files\windows ce tools\sdks\m3350_sdk\include\armv4i\stdlib.h(544) : error C2144: 语法错误 : “int”的前面应有“;”
1>d:\program files\windows ce tools\sdks\m3350_sdk\include\armv4i\stdlib.h(544) : error C4430: 缺少类型说明符 - 假定为 int。注意: C++ 不支持默认 int
1>d:\program files\windows ce tools\sdks\m3350_sdk\include\armv4i\stdlib.h(544) : error C2086: “int __checkReturn_opt”: 重定义
1>        d:\program files\windows ce tools\sdks\m3350_sdk\include\armv4i\stdlib.h(503) : 参见“__checkReturn_opt”的声明
1>d:\program files\windows ce tools\sdks\m3350_sdk\include\armv4i\stdlib.h(545) : error C2144: 语法错误 : “int”的前面应有“;”
1>d:\program files\windows ce tools\sdks\m3350_sdk\include\armv4i\stdlib.h(545) : error C4430: 缺少类型说明符 - 假定为 int。注意: C++ 不支持默认 int
1>d:\program files\windows ce tools\sdks\m3350_sdk\include\armv4i\stdlib.h(545) : error C2086: “int __checkReturn_opt”: 重定义
1>        d:\program files\windows ce tools\sdks\m3350_sdk\include\armv4i\stdlib.h(503) : 参见“__checkReturn_opt”的声明
1>d:\program files\windows ce tools\sdks\m3350_sdk\include\armv4i\stdlib.h(548) : error C2144: 语法错误 : “int”的前面应有“;”
1>d:\program files\windows ce tools\sdks\m3350_sdk\include\armv4i\stdlib.h(548) : error C4430: 缺少类型说明符 - 假定为 int。注意: C++ 不支持默认 int
1>d:\program files\windows ce tools\sdks\m3350_sdk\include\armv4i\stdlib.h(548) : error C2086: “int __checkReturn_opt”: 重定义
1>        d:\program files\windows ce tools\sdks\m3350_sdk\include\armv4i\stdlib.h(503) : 参见“__checkReturn_opt”的声明
1>d:\program files\windows ce tools\sdks\m3350_sdk\include\armv4i\stdlib.h(549) : error C2144: 语法错误 : “char”的前面应有“;”
1>d:\program files\windows ce tools\sdks\m3350_sdk\include\armv4i\stdlib.h(549) : error C4430: 缺少类型说明符 - 假定为 int。注意: C++ 不支持默认 int
1>d:\program files\windows ce tools\sdks\m3350_sdk\include\armv4i\stdlib.h(549) : error C2086: “int __checkReturn_opt”: 重定义
1>        d:\program files\windows ce tools\sdks\m3350_sdk\include\armv4i\stdlib.h(503) : 参见“__checkReturn_opt”的声明
1>d:\program files\windows ce tools\sdks\m3350_sdk\include\armv4i\stdlib.h(550) : error C2144: 语法错误 : “int”的前面应有“;”
1>d:\program files\windows ce tools\sdks\m3350_sdk\include\armv4i\stdlib.h(550) : error C4430: 缺少类型说明符 - 假定为 int。注意: C++ 不支持默认 int
1>d:\program files\windows ce tools\sdks\m3350_sdk\include\armv4i\stdlib.h(550) : error C2086: “int __checkReturn_opt”: 重定义
1>        d:\program files\windows ce tools\sdks\m3350_sdk\include\armv4i\stdlib.h(503) : 参见“__checkReturn_opt”的声明
1>d:\program files\windows ce tools\sdks\m3350_sdk\include\armv4i\stdlib.h(551) : error C2144: 语法错误 : “int”的前面应有“;”
1>d:\program files\windows ce tools\sdks\m3350_sdk\include\armv4i\stdlib.h(551) : error C4430: 缺少类型说明符 - 假定为 int。注意: C++ 不支持默认 int
1>d:\program files\windows ce tools\sdks\m3350_sdk\include\armv4i\stdlib.h(551) : error C2086: “int __checkReturn_opt”: 重定义
1>        d:\program files\windows ce tools\sdks\m3350_sdk\include\armv4i\stdlib.h(503) : 参见“__checkReturn_opt”的声明
1>d:\program files\windows ce tools\sdks\m3350_sdk\include\armv4i\stdlib.h(552) : error C2144: 语法错误 : “int”的前面应有“;”
1>d:\program files\windows ce tools\sdks\m3350_sdk\include\armv4i\stdlib.h(552) : error C4430: 缺少类型说明符 - 假定为 int。注意: C++ 不支持默认 int
1>d:\program files\windows ce tools\sdks\m3350_sdk\include\armv4i\stdlib.h(552) : error C2086: “int __checkReturn_opt”: 重定义
1>        d:\program files\windows ce tools\sdks\m3350_sdk\include\armv4i\stdlib.h(503) : 参见“__checkReturn_opt”的声明
1>d:\program files\windows ce tools\sdks\m3350_sdk\include\armv4i\stdlib.h(556) : error C2144: 语法错误 : “int”的前面应有“;”
1>d:\program files\windows ce tools\sdks\m3350_sdk\include\armv4i\stdlib.h(556) : error C4430: 缺少类型说明符 - 假定为 int。注意: C++ 不支持默认 int
1>d:\program files\windows ce tools\sdks\m3350_sdk\include\armv4i\stdlib.h(556) : error C2086: “int __checkReturn_opt”: 重定义
1>        d:\program files\windows ce tools\sdks\m3350_sdk\include\armv4i\stdlib.h(503) : 参见“__checkReturn_opt”的声明
1>d:\program files\windows ce tools\sdks\m3350_sdk\include\armv4i\stdlib.h(557) : error C2144: 语法错误 : “int”的前面应有“;”
1>d:\program files\windows ce tools\sdks\m3350_sdk\include\armv4i\stdlib.h(557) : error C4430: 缺少类型说明符 - 假定为 int。注意: C++ 不支持默认 int
1>d:\program files\windows ce tools\sdks\m3350_sdk\include\armv4i\stdlib.h(557) : error C2086: “int __checkReturn_opt”: 重定义
1>        d:\program files\windows ce tools\sdks\m3350_sdk\include\armv4i\stdlib.h(503) : 参见“__checkReturn_opt”的声明
1>d:\program files\windows ce tools\sdks\m3350_sdk\include\armv4i\stdlib.h(558) : error C2144: 语法错误 : “int”的前面应有“;”
1>d:\program files\windows ce tools\sdks\m3350_sdk\include\armv4i\stdlib.h(558) : error C4430: 缺少类型说明符 - 假定为 int。注意: C++ 不支持默认 int
1>d:\program files\windows ce tools\sdks\m3350_sdk\include\armv4i\stdlib.h(558) : error C2086: “int __checkReturn_opt”: 重定义
1>        d:\program files\windows ce tools\sdks\m3350_sdk\include\armv4i\stdlib.h(503) : 参见“__checkReturn_opt”的声明
1>d:\program files\windows ce tools\sdks\m3350_sdk\include\armv4i\stdlib.h(569) : error C2144: 语法错误 : “int”的前面应有“;”
1>d:\program files\windows ce tools\sdks\m3350_sdk\include\armv4i\stdlib.h(569) : error C4430: 缺少类型说明符 - 假定为 int。注意: C++ 不支持默认 int
1>d:\program files\windows ce tools\sdks\m3350_sdk\include\armv4i\stdlib.h(569) : error C2086: “int __checkReturn_opt”: 重定义
1>        d:\program files\windows ce tools\sdks\m3350_sdk\include\armv4i\stdlib.h(503) : 参见“__checkReturn_opt”的声明
1>d:\program files\windows ce tools\sdks\m3350_sdk\include\armv4i\stdlib.h(570) : error C2144: 语法错误 : “int”的前面应有“;”
1>d:\program files\windows ce tools\sdks\m3350_sdk\include\armv4i\stdlib.h(570) : error C4430: 缺少类型说明符 - 假定为 int。注意: C++ 不支持默认 int
1>d:\program files\windows ce tools\sdks\m3350_sdk\include\armv4i\stdlib.h(570) : error C2086: “int __checkReturn_opt”: 重定义
1>        d:\program files\windows ce tools\sdks\m3350_sdk\include\armv4i\stdlib.h(503) : 参见“__checkReturn_opt”的声明
1>d:\program files\windows ce tools\sdks\m3350_sdk\include\armv4i\stdlib.h(571) : error C2146: 语法错误 : 缺少“;”(在标识符“size_t”的前面)
1>d:\program files\windows ce tools\sdks\m3350_sdk\include\armv4i\stdlib.h(571) : error C4430: 缺少类型说明符 - 假定为 int。注意: C++ 不支持默认 int
1>d:\program files\windows ce tools\sdks\m3350_sdk\include\armv4i\stdlib.h(571) : error C2086: “int __checkReturn_opt”: 重定义
1>        d:\program files\windows ce tools\sdks\m3350_sdk\include\armv4i\stdlib.h(503) : 参见“__checkReturn_opt”的声明
1>d:\program files\windows ce tools\sdks\m3350_sdk\include\armv4i\stdlib.h(572) : error C2146: 语法错误 : 缺少“;”(在标识符“size_t”的前面)
1>d:\program files\windows ce tools\sdks\m3350_sdk\include\armv4i\stdlib.h(572) : error C4430: 缺少类型说明符 - 假定为 int。注意: C++ 不支持默认 int
1>d:\program files\windows ce tools\sdks\m3350_sdk\include\armv4i\stdlib.h(572) : error C2086: “int __checkReturn_opt”: 重定义
1>        d:\program files\windows ce tools\sdks\m3350_sdk\include\armv4i\stdlib.h(503) : 参见“__checkReturn_opt”的声明
1>d:\program files\windows ce tools\sdks\m3350_sdk\include\armv4i\stdlib.h(573) : error C2144: 语法错误 : “int”的前面应有“;”
1>d:\program files\windows ce tools\sdks\m3350_sdk\include\armv4i\stdlib.h(573) : error C4430: 缺少类型说明符 - 假定为 int。注意: C++ 不支持默认 int
1>d:\program files\windows ce tools\sdks\m3350_sdk\include\armv4i\stdlib.h(573) : error C2086: “int __checkReturn_opt”: 重定义
1>        d:\program files\windows ce tools\sdks\m3350_sdk\include\armv4i\stdlib.h(503) : 参见“__checkReturn_opt”的声明
1>d:\program files\windows ce tools\sdks\m3350_sdk\include\armv4i\stdlib.h(574) : error C2144: 语法错误 : “int”的前面应有“;”
1>d:\program files\windows ce tools\sdks\m3350_sdk\include\armv4i\stdlib.h(574) : error C4430: 缺少类型说明符 - 假定为 int。注意: C++ 不支持默认 int
1>d:\program files\windows ce tools\sdks\m3350_sdk\include\armv4i\stdlib.h(574) : error C2086: “int __checkReturn_opt”: 重定义
1>        d:\program files\windows ce tools\sdks\m3350_sdk\include\armv4i\stdlib.h(503) : 参见“__checkReturn_opt”的声明
1>d:\program files\windows ce tools\sdks\m3350_sdk\include\armv4i\stdlib.h(578) : error C2144: 语法错误 : “int”的前面应有“;”
1>d:\program files\windows ce tools\sdks\m3350_sdk\include\armv4i\stdlib.h(578) : error C4430: 缺少类型说明符 - 假定为 int。注意: C++ 不支持默认 int
1>d:\program files\windows ce tools\sdks\m3350_sdk\include\armv4i\stdlib.h(578) : error C2086: “int __checkReturn_opt”: 重定义
1>        d:\program files\windows ce tools\sdks\m3350_sdk\include\armv4i\stdlib.h(503) : 参见“__checkReturn_opt”的声明
1>d:\program files\windows ce tools\sdks\m3350_sdk\include\armv4i\stdlib.h(579) : error C2144: 语法错误 : “int”的前面应有“;”
1>d:\program files\windows ce tools\sdks\m3350_sdk\include\armv4i\stdlib.h(579) : error C4430: 缺少类型说明符 - 假定为 int。注意: C++ 不支持默认 int
1>d:\program files\windows ce tools\sdks\m3350_sdk\include\armv4i\stdlib.h(579) : error C2086: “int __checkReturn_opt”: 重定义
1>        d:\program files\windows ce tools\sdks\m3350_sdk\include\armv4i\stdlib.h(503) : 参见“__checkReturn_opt”的声明
1>d:\program files\windows ce tools\sdks\m3350_sdk\include\armv4i\stdlib.h(580) : error C2144: 语法错误 : “int”的前面应有“;”
1>d:\program files\windows ce tools\sdks\m3350_sdk\include\armv4i\stdlib.h(580) : error C4430: 缺少类型说明符 - 假定为 int。注意: C++ 不支持默认 int
1>d:\program files\windows ce tools\sdks\m3350_sdk\include\armv4i\stdlib.h(580) : error C2086: “int __checkReturn_opt”: 重定义
1>        d:\program files\windows ce tools\sdks\m3350_sdk\include\armv4i\stdlib.h(503) : 参见“__checkReturn_opt”的声明
1>d:\program files\windows ce tools\sdks\m3350_sdk\include\armv4i\stdlib.h(598) : error C2144: 语法错误 : “int”的前面应有“;”
1>d:\program files\windows ce tools\sdks\m3350_sdk\include\armv4i\stdlib.h(598) : error C4430: 缺少类型说明符 - 假定为 int。注意: C++ 不支持默认 int
1>d:\program files\windows ce tools\sdks\m3350_sdk\include\armv4i\stdlib.h(598) : error C2086: “int __checkReturn_opt”: 重定义
1>        d:\program files\windows ce tools\sdks\m3350_sdk\include\armv4i\stdlib.h(503) : 参见“__checkReturn_opt”的声明
1>d:\program files\windows ce tools\sdks\m3350_sdk\include\armv4i\stdlib.h(599) : error C2144: 语法错误 : “int”的前面应有“;”
1>d:\program files\windows ce tools\sdks\m3350_sdk\include\armv4i\stdlib.h(599) : error C4430: 缺少类型说明符 - 假定为 int。注意: C++ 不支持默认 int
1>d:\program files\windows ce tools\sdks\m3350_sdk\include\armv4i\stdlib.h(599) : error C2086: “int __checkReturn_opt”: 重定义
1>        d:\program files\windows ce tools\sdks\m3350_sdk\include\armv4i\stdlib.h(503) : 参见“__checkReturn_opt”的声明
1>d:\program files\windows ce tools\sdks\m3350_sdk\include\armv4i\stdlib.h(600) : error C2144: 语法错误 : “int”的前面应有“;”
1>d:\program files\windows ce tools\sdks\m3350_sdk\include\armv4i\stdlib.h(600) : error C4430: 缺少类型说明符 - 假定为 int。注意: C++ 不支持默认 int
1>d:\program files\windows ce tools\sdks\m3350_sdk\include\armv4i\stdlib.h(600) : error C2086: “int __checkReturn_opt”: 重定义
1>        d:\program files\windows ce tools\sdks\m3350_sdk\include\armv4i\stdlib.h(503) : 参见“__checkReturn_opt”的声明
1>d:\program files\windows ce tools\sdks\m3350_sdk\include\armv4i\stdlib.h(602) : error C2146: 语法错误 : 缺少“;”(在标识符“wint_t”的前面)
1>d:\program files\windows ce tools\sdks\m3350_sdk\include\armv4i\stdlib.h(602) : error C4430: 缺少类型说明符 - 假定为 int。注意: C++ 不支持默认 int
1>d:\program files\windows ce tools\sdks\m3350_sdk\include\armv4i\stdlib.h(602) : error C2086: “int __checkReturn_opt”: 重定义
1>        d:\program files\windows ce tools\sdks\m3350_sdk\include\armv4i\stdlib.h(503) : 参见“__checkReturn_opt”的声明
1>d:\program files\windows ce tools\sdks\m3350_sdk\include\armv4i\stdlib.h(603) : error C2144: 语法错误 : “wchar_t”的前面应有“;”
1>d:\program files\windows ce tools\sdks\m3350_sdk\include\armv4i\stdlib.h(603) : error C4430: 缺少类型说明符 - 假定为 int。注意: C++ 不支持默认 int
1>d:\program files\windows ce tools\sdks\m3350_sdk\include\armv4i\stdlib.h(603) : error C2086: “int __checkReturn_opt”: 重定义
1>        d:\program files\windows ce tools\sdks\m3350_sdk\include\armv4i\stdlib.h(503) : 参见“__checkReturn_opt”的声明
1>d:\program files\windows ce tools\sdks\m3350_sdk\include\armv4i\stdlib.h(606) : error C2144: 语法错误 : “int”的前面应有“;”
1>d:\program files\windows ce tools\sdks\m3350_sdk\include\armv4i\stdlib.h(606) : error C4430: 缺少类型说明符 - 假定为 int。注意: C++ 不支持默认 int
1>d:\program files\windows ce tools\sdks\m3350_sdk\include\armv4i\stdlib.h(606) : error C2086: “int __checkReturn_opt”: 重定义
1>        d:\program files\windows ce tools\sdks\m3350_sdk\include\armv4i\stdlib.h(503) : 参见“__checkReturn_opt”的声明
1>d:\program files\windows ce tools\sdks\m3350_sdk\include\armv4i\stdlib.h(609) : error C2146: 语法错误 : 缺少“;”(在标识符“wint_t”的前面)
1>d:\program files\windows ce tools\sdks\m3350_sdk\include\armv4i\stdlib.h(609) : error C4430: 缺少类型说明符 - 假定为 int。注意: C++ 不支持默认 int
1>d:\program files\windows ce tools\sdks\m3350_sdk\include\armv4i\stdlib.h(609) : error C2086: “int __checkReturn_opt”: 重定义
1>        d:\program files\windows ce tools\sdks\m3350_sdk\include\armv4i\stdlib.h(503) : 参见“__checkReturn_opt”的声明
1>d:\program files\windows ce tools\sdks\m3350_sdk\include\armv4i\stdlib.h(610) : error C2146: 语法错误 : 缺少“;”(在标识符“wint_t”的前面)
1>d:\program files\windows ce tools\sdks\m3350_sdk\include\armv4i\stdlib.h(610) : error C4430: 缺少类型说明符 - 假定为 int。注意: C++ 不支持默认 int
1>d:\program files\windows ce tools\sdks\m3350_sdk\include\armv4i\stdlib.h(610) : error C2086: “int __checkReturn_opt”: 重定义
1>        d:\program files\windows ce tools\sdks\m3350_sdk\include\armv4i\stdlib.h(503) : 参见“__checkReturn_opt”的声明
1>d:\program files\windows ce tools\sdks\m3350_sdk\include\armv4i\stdlib.h(611) : error C2146: 语法错误 : 缺少“;”(在标识符“wint_t”的前面)
1>d:\program files\windows ce tools\sdks\m3350_sdk\include\armv4i\stdlib.h(611) : error C4430: 缺少类型说明符 - 假定为 int。注意: C++ 不支持默认 int
1>d:\program files\windows ce tools\sdks\m3350_sdk\include\armv4i\stdlib.h(611) : error C2086: “int __checkReturn_opt”: 重定义
1>        d:\program files\windows ce tools\sdks\m3350_sdk\include\armv4i\stdlib.h(503) : 参见“__checkReturn_opt”的声明
1>d:\program files\windows ce tools\sdks\m3350_sdk\include\armv4i\stdlib.h(612) : error C2144: 语法错误 : “wchar_t”的前面应有“;”
1>d:\program files\windows ce tools\sdks\m3350_sdk\include\armv4i\stdlib.h(612) : fatal error C1003: 错误计数超过 100;正在停止编译
1>Build log was saved at "file://c:\Users\xmlee\Desktop\mini3350arm板\M3352-N128WI\M3352-N128WI CD V1.02\3.WinCE\6.开发示例\VS2008\1、开发快速入门\1、最简单的应用程序开发示例\Hello World\Hello World\M3350_SDK (ARMV4I)\Debug\BuildLog.htm"
1>Hello World - 153 error(s), 0 warning(s)
========== Build: 0 succeeded, 1 failed, 0 up-to-date, 0 skipped ==========
========== Deploy: 0 succeeded, 0 failed, 0 skipped ==========
搜索更多相关主题的帖子: windows  解决方案  include  started  对话框  
2014-08-20 15:34
tlliqi
Rank: 19Rank: 19Rank: 19Rank: 19Rank: 19Rank: 19
等 级:贵宾
威 望:204
帖 子:15455
专家分:65956
注 册:2006-4-27
  得分:9 
这么多
2014-08-20 19:44
hu9jj
Rank: 20Rank: 20Rank: 20Rank: 20Rank: 20
来 自:红土地
等 级:贵宾
威 望:337
帖 子:11235
专家分:42261
注 册:2006-5-13
  得分:9 
楼主将一大堆出错内容贴出来,大家给出的帮助也许只有一句话:按照出错的提示逐个排查。这也是调试程序的最基本的做法。

活到老,学到老! http://www.qs98.com E-mail:hu-jj@21cn.com
2014-08-24 06:43







关于我们 | 广告合作 | 编程中国 | 清除Cookies | TOP | 手机版

编程中国 版权所有,并保留所有权利。
Powered by Discuz, Processed in 0.127302 second(s), 8 queries.
Copyright©2004-2018, BCCN.NET, All Rights Reserved